BDBM20332 3-[(4-tert-butylphenyl)methyl]-1-[2-(4-methanesulfonamido-3-methoxyphenyl)propan-2-yl]thiourea::thiourea analogue, 60
SMILES COc1cc(ccc1NS(C)(=O)=O)C(C)(C)NC(=S)NCc1ccc(cc1)C(C)(C)C
InChI Key InChIKey=PTLGVGAYBQPZMG-UHFFFAOYSA-N
Data  1 KI  1 EC50
  Tab Delimited (TSV)   2D SDfile   Computed 3D by Vconf -m prep SDfile
Find this compound or compounds like it in BindingDB:
Activity Spreadsheet -- Enzyme Inhibition Constant Data from BindingDB
Found 1 hit for monomerid = 20332
TargetTransient receptor potential cation channel subfamily V member 1(Rattus norvegicus (rat))
Seoul National University
LigandPNGBDBM20332(3-[(4-tert-butylphenyl)methyl]-1-[2-(4-methanesulf...)
Affinity DataKi:  2.89E+3nM ΔG°:  -7.86kcal/mole EC50:  663nMpH: 7.4 T: 2°C. Assay description: Binding assay mixtures were set up and contained [3H] RTX, various concentrations of competing ligands, and rVR1-transfected CHO cells. Nonspecific b...
In DepthDetails ArticlePubMed