BDBM203451 US9242982, 1c
SMILES Cn1c2[nH]c(=O)c(Cc3cccc(F)c3)cc2c(=O)n(C)c1=O
InChI Key InChIKey=KRHIBMIIIVWLSL-UHFFFAOYSA-N
Data  1 IC50
  Tab Delimited (TSV)   2D SDfile   Computed 3D by Vconf -m prep SDfile
Find this compound or compounds like it in BindingDB:
Activity Spreadsheet -- Enzyme Inhibition Constant Data from BindingDB
Found 1 hit for monomerid = 203451
TargetcGMP-inhibited 3',5'-cyclic phosphodiesterase 3A/3B(Homo sapiens (Human))
Council Of Scientific & Industrial Research
US Patent
LigandPNGBDBM203451(US9242982, 1c)
Affinity DataIC50:  32.3nMT: 2°C. Assay description: PDE3 inhibition assay was performed a BIOMOL GREEN Quantizyme Assay System (catalogue No. BML-AK800-0001). The Platelets isolated from human blood ...
Ligand InfoPC cidPC sid
In DepthDetails US Patent