BDBM203846 (2E)-2-[(2-chloro-3-methoxyphenyl)methylidene]-6,7-dimethoxy-1,2,3,4-tetrahydronaphthalen-1-one (3s)
SMILES COc1cccc(\C=C2/CCc3cc(OC)c(OC)cc3C2=O)c1Cl
InChI Key InChIKey=XYMGHHFXYPPIAA-NTEUORMPSA-N
Data  4 IC50
  Tab Delimited (TSV)   2D SDfile   Computed 3D by Vconf -m prep SDfile
Find this compound or compounds like it in BindingDB:
Activity Spreadsheet -- Enzyme Inhibition Constant Data from BindingDB
Found 4 hits for monomerid = 203846
TargetAcetylcholinesterase(Electrophorus electricus (Electric eel))
Wuhan University Of Technology
LigandPNGBDBM203846((2E)-2-[(2-chloro-3-methoxyphenyl)methylidene]-6,7...)
Affinity DataIC50:  2.95E+4nMpH: 8.0 T: 2°C. Assay description: This spectrophotometric assay is based on the reaction of 5,5-dithio-bis(2-nitrobenzoic)acid (DTNB) with thiocholine to yield a colored product. Sh...
Ligand InfoPC cidPC sid
In DepthDetails ArticlePubMed
TargetAmine oxidase [flavin-containing] B(Rattus norvegicus (rat))
Wuhan University Of Technology
LigandPNGBDBM203846((2E)-2-[(2-chloro-3-methoxyphenyl)methylidene]-6,7...)
Affinity DataIC50:  7.20E+3nMpH: 7.4 T: 2°C. Assay description: A fluorimetric method reported by Matsumoto et al.[T. Matsumoto, O. Suzuki, T. Furuta, M. Asai, Y. Kurokawa, Y. Nimura, Y. Katsumata, I. Takahashi. C...
Ligand InfoPC cidPC sid
In DepthDetails ArticlePubMed
TargetAmine oxidase [flavin-containing] A(Rattus norvegicus (rat))
Wuhan University Of Technology
LigandPNGBDBM203846((2E)-2-[(2-chloro-3-methoxyphenyl)methylidene]-6,7...)
Affinity DataIC50: >1.00E+5nMpH: 7.4 T: 2°C. Assay description: A fluorimetric method reported by Matsumoto et al.[T. Matsumoto, O. Suzuki, T. Furuta, M. Asai, Y. Kurokawa, Y. Nimura, Y. Katsumata, I. Takahashi. C...
Ligand InfoPC cidPC sid
In DepthDetails ArticlePubMed
TargetCarboxylic ester hydrolase(Equus caballus (Horse))
Wuhan University Of Technology
LigandPNGBDBM203846((2E)-2-[(2-chloro-3-methoxyphenyl)methylidene]-6,7...)
Affinity DataIC50: >1.00E+5nMpH: 8.0 T: 2°C. Assay description: This spectrophotometric assay is based on the reaction of 5,5-dithio-bis(2-nitrobenzoic)acid (DTNB) with thiocholine to yield a colored product. Sh...
Ligand InfoPC cidPC sid
In DepthDetails ArticlePubMed