BDBM203999 2-{[(3r,6r)-1-{[4-methoxy-2- (2h-1,2,3-triazol-2- yl)phenyl]carbonyl}-6- methylpiperidin-3-yl]oxy}-3- methylpyridine-4-carbonitrile::US9546152, example 7
SMILES COc1ccc(C(=O)N2C[C@@H](CC[C@H]2C)Oc2nccc(C#N)c2C)c(c1)-n1nccn1
InChI Key InChIKey=GNXXSBWPJIOWSN-DNVCBOLYSA-N
Data  4 KI  4 IC50
  Tab Delimited (TSV)   2D SDfile   Computed 3D by Vconf -m prep SDfile
Find this compound or compounds like it in BindingDB:
Activity Spreadsheet -- Enzyme Inhibition Constant Data from BindingDB
Found 8 hits for monomerid = 203999
TargetOrexin receptor type 2(Homo sapiens (Human))
Merck Sharp & Dohme
US Patent
LigandPNGBDBM203999(2-{[(3r,6r)-1-{[4-methoxy-2- (2h-1,2,3-triazol-2- ...)
Affinity DataKi:  1.30nM. Assay description: Radioligand binding assay (described in Bergman et. al. Bioorg. Med. Chem. Lett. 2008, 18, 1425-1430) in which the inhibition constant (Ki) is determ...
Ligand InfoPC cidPC sid
In DepthDetails US Patent
TargetOrexin receptor type 2(Homo sapiens (Human))
Merck Sharp & Dohme
US Patent
LigandPNGBDBM203999(2-{[(3r,6r)-1-{[4-methoxy-2- (2h-1,2,3-triazol-2- ...)
Affinity DataKi:  1.30nM. Assay description: Displacement of [3H](S)-N-(2-(1H-pyrrol-1-yl)phenyl)-1-(2-(1-methyl-1H-benzo[d]imidazol-2-ylthio)acetyl)pyrrolidine-2-carboxamide from human OX2R exp...
Ligand InfoPC cidPC sid
In DepthDetails ArticlePubMed
TargetOrexin/Hypocretin receptor type 1(Homo sapiens (Human))
Merck Sharp & Dohme
US Patent
LigandPNGBDBM203999(2-{[(3r,6r)-1-{[4-methoxy-2- (2h-1,2,3-triazol-2- ...)
Affinity DataKi:  1.17E+3nM. Assay description: Radioligand binding assay (described in Bergman et. al. Bioorg. Med. Chem. Lett. 2008, 18, 1425-1430) in which the inhibition constant (Ki) is determ...
Ligand InfoPC cidPC sid
In DepthDetails US Patent
TargetOrexin/Hypocretin receptor type 1(Homo sapiens (Human))
Merck Sharp & Dohme
US Patent
LigandPNGBDBM203999(2-{[(3r,6r)-1-{[4-methoxy-2- (2h-1,2,3-triazol-2- ...)
Affinity DataKi:  1.17E+3nM. Assay description: Displacement of [3H](S)-N-(biphenyl-2-yl)-1-(2-(1-methyl-1H-benzo[d]imidazol-2-ylthio)acetyl)pyrrolidine-2-carboxamide from human OX1R expressed in C...
Ligand InfoPC cidPC sid
In DepthDetails ArticlePubMed
TargetOrexin/Hypocretin receptor type 1(Homo sapiens (Human))
Merck Sharp & Dohme
US Patent
LigandPNGBDBM203999(2-{[(3r,6r)-1-{[4-methoxy-2- (2h-1,2,3-triazol-2- ...)
Affinity DataIC50:  6.12E+3nM. Assay description: Antagonist activity at human OX1R expressed in CHOK1 cells assessed as reduction in orexin A-induced calcium flux preincubated followed by orexin A a...
Ligand InfoPC cidPC sid
In DepthDetails ArticlePubMed
TargetOrexin receptor type 2(Homo sapiens (Human))
Merck Sharp & Dohme
US Patent
LigandPNGBDBM203999(2-{[(3r,6r)-1-{[4-methoxy-2- (2h-1,2,3-triazol-2- ...)
Affinity DataIC50:  13nM. Assay description: Antagonist activity at human OX2R expressed in CHOK1 cells assessed as reduction in orexin A-induced calcium flux preincubated followed by orexin A a...
Ligand InfoPC cidPC sid
In DepthDetails ArticlePubMed
TargetOrexin receptor type 2(Homo sapiens (Human))
Merck Sharp & Dohme
US Patent
LigandPNGBDBM203999(2-{[(3r,6r)-1-{[4-methoxy-2- (2h-1,2,3-triazol-2- ...)
Affinity DataIC50:  13nM. Assay description: The utility of the compounds in accordance with the present invention as orexin receptor OX1R and/or OX2R antagonists may be readily determined witho...
Ligand InfoPC cidPC sid
In DepthDetails US Patent
TargetOrexin/Hypocretin receptor type 1(Homo sapiens (Human))
Merck Sharp & Dohme
US Patent
LigandPNGBDBM203999(2-{[(3r,6r)-1-{[4-methoxy-2- (2h-1,2,3-triazol-2- ...)
Affinity DataIC50:  6.12E+3nM. Assay description: The utility of the compounds in accordance with the present invention as orexin receptor OX1R and/or OX2R antagonists may be readily determined witho...
Ligand InfoPC cidPC sid
In DepthDetails US Patent