BDBM204532 US9242998, 10
SMILES CNC(=O)c1c(oc2cc(N(C)S(C)(=O)=O)c(cc12)-c1ccc2OCn3c(cc4c(F)cccc34)-c2n1)-c1ccc(OC(C)C)nc1
InChI Key InChIKey=NEGLMTYJFAMFMQ-UHFFFAOYSA-N
Data  2 IC50
  Tab Delimited (TSV)   2D SDfile   Computed 3D by Vconf -m prep SDfile
Find this compound or compounds like it in BindingDB:
Activity Spreadsheet -- Enzyme Inhibition Constant Data from BindingDB
Found 2 hits for monomerid = 204532
TargetGenome polyprotein(Hepatitis C Virus (Virus))
Merck Sharp & Dohme
US Patent
LigandPNGBDBM204532(US9242998, 10)
Affinity DataIC50:  13nM. Assay description: To initiate an assay, replicon cells were plated in the presence of a dilution series of test compound in the absence of G418. Typically, the assays ...
Ligand InfoPC cidPC sid
In DepthDetails US Patent
TargetGenome polyprotein(Hepatitis C virus (HCV genotype 1a, isolate H))
Merck Sharp & Dohme
US Patent
LigandPNGBDBM204532(US9242998, 10)
Affinity DataIC50:  15nM. Assay description: To initiate an assay, replicon cells were plated in the presence of a dilution series of test compound in the absence of G418. Typically, the assays ...
Ligand InfoPC cidPC sid
In DepthDetails US Patent