BDBM2046 2,8-disubstituted dipyridodiazepinone 29::2-Chloro-5,11-dihydro-11-ethyl-5-methyl-8-(4-pyridyloxy)methyl-6H-dipyrido[3,2-b:2 ,3 -e][1,4]diazepin-6-one::5-chloro-2-ethyl-9-methyl-13-[(pyridin-4-yloxy)methyl]-2,4,9,15-tetraazatricyclo[9.4.0.0^{3,8}]pentadeca-1(11),3,5,7,12,14-hexaen-10-one
SMILES CCN1c2nc(Cl)ccc2N(C)C(=O)c2cc(COc3ccncc3)cnc12
InChI Key InChIKey=SSBKOEBEWJHUQR-UHFFFAOYSA-N
Data  3 IC50
  Tab Delimited (TSV)   2D SDfile   Computed 3D by Vconf -m prep SDfile
Find this compound or compounds like it in BindingDB:
Activity Spreadsheet -- Enzyme Inhibition Constant Data from BindingDB
Found 3 hits for monomerid = 2046
TargetGag-Pol polyprotein [600-1027,R876K]/[600-1155](Human immunodeficiency virus type 1)
Boehringer Ingelheim Pharmaceuticals
LigandPNGBDBM2046(2,8-disubstituted dipyridodiazepinone 29 | 2-Chlor...)
Affinity DataIC50:  70nMpH: 7.8 T: 2°C. Assay description: The IC50 of reverse transcriptase is the concentration that inhibits 50% of recombinant HIV-1 RT RNA-directed DNA polymerase activity in vitro.
In DepthDetails ArticlePubMed
TargetReverse transcriptase/RNaseH(Human immunodeficiency virus 1)
Boehringer Ingelheim Pharmaceuticals
LigandPNGBDBM2046(2,8-disubstituted dipyridodiazepinone 29 | 2-Chlor...)
Affinity DataIC50:  180nM. Assay description: Inhibitory activity against HIV-1 Mutant Reverse transcriptase P236L
In DepthDetails ArticlePubMed
TargetGag-Pol polyprotein [600-1027,Y780C]/[600-1155,Y780C](Human immunodeficiency virus type 1)
Boehringer Ingelheim Pharmaceuticals
LigandPNGBDBM2046(2,8-disubstituted dipyridodiazepinone 29 | 2-Chlor...)
Affinity DataIC50:  260nMpH: 7.8 T: 2°C. Assay description: The IC50 of reverse transcriptase is the concentration that inhibits 50% of recombinant HIV-1 RT RNA-directed DNA polymerase activity in vitro.
In DepthDetails ArticlePubMed