BDBM204784 6-(2-fluoro-4-iodophenylamino)-7-(3-hydroxy-3-(piperidin-2-yl)azetidine-1-carbonyl)-5-methylfuro[3,2-c]pyridin-4(5h)-one::US9540396, 38
SMILES CSc1nc2c(C(=O)NOCCO)c(Nc3ccc(I)cc3Cl)n(C)c(=O)c2s1
InChI Key InChIKey=LEWMMOZLNMQXOM-UHFFFAOYSA-N
Data  1 IC50
  Tab Delimited (TSV)   2D SDfile   Computed 3D by Vconf -m prep SDfile
Find this compound or compounds like it in BindingDB:
Activity Spreadsheet -- Enzyme Inhibition Constant Data from BindingDB
Found 1 hit for monomerid = 204784
TargetDual specificity mitogen-activated protein kinase kinase 1(Homo sapiens (Human))
Centaurus Biopharma
US Patent
LigandPNGBDBM204784(6-(2-fluoro-4-iodophenylamino)-7-(3-hydroxy-3-(pip...)
Affinity DataIC50: <100nMpH: 7.4 T: 2°C. Assay description: Compounds were diluted from DMSO stocks into 1× buffer (20 mM MOPS, PH 7.4, 5 mM MgCl2, 0.5 mM MnCl2, 100 uM Sodium Orthovanadate, 0.01% Triton X-100...
Ligand InfoPC cidPC sid
In DepthDetails US Patent