BDBM204792 US9546168, ex 5
SMILES C[C@@H](NC(=O)Nc1cc2[nH]nc(C3CC3)c2c(CO)n1)c1ccccc1
InChI Key
Data  1 IC50
  Tab Delimited (TSV)   2D SDfile   Computed 3D by Vconf -m prep SDfile
Find this compound or compounds like it in BindingDB:
Activity Spreadsheet -- Enzyme Inhibition Constant Data from BindingDB
Found 1 hit for monomerid = 204792
TargetMitogen-activated protein kinase 1(Homo sapiens (Human))
Merck Sharp & Dohme
US Patent
LigandPNGBDBM204792(US9546168, ex 5)
Affinity DataIC50:  0.720nM. Assay description: Activated ERK2 activity was determined in an IMAP-FP assay (Molecular Devices). Using this assay format, the potency (IC.sub.50) of each compound was...
Ligand InfoPC cidPC sid
In DepthDetails US Patent