BDBM204798 US9546168, ex 8
SMILES C[C@@H](O)[C@@H](NC(=O)Nc1cc2[nH]nc(C3CC3)c2c(CO)n1)c1ccc(F)cc1
InChI Key
Data  1 IC50
  Tab Delimited (TSV)   2D SDfile   Computed 3D by Vconf -m prep SDfile
Find this compound or compounds like it in BindingDB:
Activity Spreadsheet -- Enzyme Inhibition Constant Data from BindingDB
Found 1 hit for monomerid = 204798
TargetMitogen-activated protein kinase 1(Homo sapiens (Human))
Merck Sharp & Dohme
US Patent
LigandPNGBDBM204798(US9546168, ex 8)
Affinity DataIC50:  0.910nM. Assay description: Activated ERK2 activity was determined in an IMAP-FP assay (Molecular Devices). Using this assay format, the potency (IC.sub.50) of each compound was...
Ligand InfoPC cidPC sid
In DepthDetails US Patent