BDBM204931 Example 1::[2-(indan-2-ylamino)-7,8-dihydro-5H-pyrido[4,3-d]pyrimidin-6-yl]-[1-(1H-triazol-4-ylmethyl)pyrazol-4-yl]methanone
SMILES O=C(N1CCc2nc(NC3Cc4ccccc4C3)ncc2C1)c1cnn(Cc2c[nH]nn2)c1
InChI Key InChIKey=YRYZVGLGPDMBBP-UHFFFAOYSA-N
Data  1 IC50
  Tab Delimited (TSV)   2D SDfile   Computed 3D by Vconf -m prep SDfile
Find this compound or compounds like it in BindingDB:
Activity Spreadsheet -- Enzyme Inhibition Constant Data from BindingDB
Found 1 hit for monomerid = 204931
TargetEctonucleotide pyrophosphatase/phosphodiesterase family member 2(Homo sapiens (Human))
Eli Lilly
US Patent
LigandPNGBDBM204931(Example 1 | [2-(indan-2-ylamino)-7,8-dihydro-5H-py...)
Affinity DataIC50: <1.70nM. Assay description: The purpose of this assay is to detect autotaxin inhibition using a choline release assay.Test compound (10 mM stocks in 100% DMSO) is serially dilut...
Ligand InfoPC cidPC sid
In DepthDetails US Patent