BDBM204995 US9249096, 3
SMILES CN1CC(C(=O)NCCc2ccccc2)=C(O)C1=O
InChI Key InChIKey=LOQCGFYTTYMYAV-UHFFFAOYSA-N
Data  2 IC50
  Tab Delimited (TSV)   2D SDfile   Computed 3D by Vconf -m prep SDfile
Find this compound or compounds like it in BindingDB:
Activity Spreadsheet -- Enzyme Inhibition Constant Data from BindingDB
Found 2 hits for monomerid = 204995
TargetEndothelial lipase(Homo sapiens (Human))
Bristol-Myers Squibb
Curated by ChEMBL
LigandPNGBDBM204995(US9249096, 3)
Affinity DataIC50:  2.95E+3nM. Assay description: Inhibition of endothelial lipase in human HT1080 cells using PED-A1 containing DMPG vesicles as substrate pretreated for 20 mins followed by substrat...
Ligand InfoPC cidPC sid
In DepthDetails ArticlePubMed
TargetEndothelial lipase(Homo sapiens (Human))
Bristol-Myers Squibb
Curated by ChEMBL
LigandPNGBDBM204995(US9249096, 3)
Affinity DataIC50:  2.95E+3nMpH: 8.0 T: 2°C. Assay description: The enzymatic assay was measured using white, opaque 96-well half area plates. Each well contained 60 uL of assay buffer (50 mM HEPES pH 8.0, 50 mM N...
Ligand InfoPC cidPC sid
In DepthDetails US Patent