BDBM205006 US9249096, 17
SMILES CN1C(C(C(=O)NCCCc2ccc(Cl)c(Cl)c2)=C(O)C1=O)C(C)(C)C
InChI Key InChIKey=JLHGGGSVJIGYGK-UHFFFAOYSA-N
Data  1 IC50
  Tab Delimited (TSV)   2D SDfile   Computed 3D by Vconf -m prep SDfile
Find this compound or compounds like it in BindingDB:
Activity Spreadsheet -- Enzyme Inhibition Constant Data from BindingDB
Found 1 hit for monomerid = 205006
TargetEndothelial lipase(Homo sapiens (Human))
Bristol-Myers Squibb
US Patent
LigandPNGBDBM205006(US9249096, 17)
Affinity DataIC50:  430nMpH: 8.0 T: 2°C. Assay description: The enzymatic assay was measured using white, opaque 96-well half area plates. Each well contained 60 uL of assay buffer (50 mM HEPES pH 8.0, 50 mM N...
Ligand InfoPC cidPC sid
In DepthDetails US Patent