BDBM205059 US9556132, 23::process for preparing 5-[2-(2-bromophenyl)phenyl]-1-(2-fluorophenyl)-1h-1,2,3,4-tetrazole
SMILES Fc1ccccc1-n1nnnc1-c1ccccc1-c1ccccc1Br
InChI Key InChIKey=ZIVOXTYYWOMVOG-UHFFFAOYSA-N
Data  1 IC50
  Tab Delimited (TSV)   2D SDfile   Computed 3D by Vconf -m prep SDfile
Find this compound or compounds like it in BindingDB:
Activity Spreadsheet -- Enzyme Inhibition Constant Data from BindingDB
Found 1 hit for monomerid = 205059
LigandPNGBDBM205059(US9556132, 23 | process for preparing 5-[2-(2-brom...)
Affinity DataIC50:  550nMpH: 7.3Assay Description:Human HEK293 cells over-expressing human IK are grown in culture medium (DMEM supplemented with 10% foetal bovine serum), in polystyrene culture flas...
Ligand InfoPC cidPC sid
In DepthDetails US Patent