BDBM20509 1-(2-bromophenyl)-3-[(3R)-1-(5-methylpyridin-2-yl)pyrrolidin-3-yl]urea::pyrrolidine urea analogue, 20
SMILES Cc1ccc(nc1)N1CC[C@H](C1)NC(=O)Nc1ccccc1Br
InChI Key InChIKey=MSVKDRHEWVZYBQ-CYBMUJFWSA-N
Data  1 EC50
  Tab Delimited (TSV)   2D SDfile   Computed 3D by Vconf -m prep SDfile
Find this compound or compounds like it in BindingDB:
Activity Spreadsheet -- Enzyme Inhibition Constant Data from BindingDB
Found 1 hit for monomerid = 20509
LigandPNGBDBM20509(1-(2-bromophenyl)-3-[(3R)-1-(5-methylpyridin-2-yl)...)
Affinity DataEC50: >200nMpH: 7.2 T: 2°C. Assay description: One day before the assay was performed, human TRPV1 expressed in 1321N1 astrocytoma cells were plated onto 96-well assay plates and grown until 2.5 h...
In DepthDetails ArticlePubMed