BDBM205135 US9249096, 208
SMILES CN1CC(C(=O)NCCCc2c(Cl)cccc2Cl)=C(O)C1=O
InChI Key InChIKey=LFBGEXVUCCLJOR-UHFFFAOYSA-N
Data  1 IC50
  Tab Delimited (TSV)   2D SDfile   Computed 3D by Vconf -m prep SDfile
Find this compound or compounds like it in BindingDB:
Activity Spreadsheet -- Enzyme Inhibition Constant Data from BindingDB
Found 1 hit for monomerid = 205135
TargetEndothelial lipase(Homo sapiens (Human))
Bristol-Myers Squibb
US Patent
LigandPNGBDBM205135(US9249096, 208)
Affinity DataIC50:  384nMpH: 8.0 T: 2°C. Assay description: The enzymatic assay was measured using white, opaque 96-well half area plates. Each well contained 60 uL of assay buffer (50 mM HEPES pH 8.0, 50 mM N...
Ligand InfoPC cidPC sid
In DepthDetails US Patent