BDBM205151 US9249096, 235
SMILES CN1CC(C(=O)NC(CCc2ccc(Cl)c(Cl)c2)c2ccccc2)=C(O)C1=O
InChI Key InChIKey=VPYLKFQPBRAZQH-UHFFFAOYSA-N
Data  1 IC50
  Tab Delimited (TSV)   2D SDfile   Computed 3D by Vconf -m prep SDfile
Find this compound or compounds like it in BindingDB:
Activity Spreadsheet -- Enzyme Inhibition Constant Data from BindingDB
Found 1 hit for monomerid = 205151
TargetEndothelial lipase(Homo sapiens (Human))
Bristol-Myers Squibb
US Patent
LigandPNGBDBM205151(US9249096, 235)
Affinity DataIC50:  3.06E+3nMpH: 8.0 T: 2°C. Assay description: The enzymatic assay was measured using white, opaque 96-well half area plates. Each well contained 60 uL of assay buffer (50 mM HEPES pH 8.0, 50 mM N...
Ligand InfoPC cidPC sid
In DepthDetails US Patent