BDBM205350 US9249139, 1g
SMILES CCOC(=O)c1cc(Cc2ccc(Cl)cc2)c(=O)n2CCCc12
InChI Key InChIKey=ZIBQGIQYIVOFFZ-UHFFFAOYSA-N
Data  1 IC50
  Tab Delimited (TSV)   2D SDfile   Computed 3D by Vconf -m prep SDfile
Find this compound or compounds like it in BindingDB:
Activity Spreadsheet -- Enzyme Inhibition Constant Data from BindingDB
Found 1 hit for monomerid = 205350
TargetcGMP-inhibited 3',5'-cyclic phosphodiesterase 3A/3B(Homo sapiens (Human))
Council Of Scientific & Industrial Research
US Patent
LigandPNGBDBM205350(US9249139, 1g)
Affinity DataIC50:  108nMT: 2°C. Assay description: PDE3 inhibition assay was performed a BIOMOL GREEN Quantizyme Assay System (catalogue No. BML-AK800-0001). The Platelets isolated from human blood ...
Ligand InfoPC cidPC sid
In DepthDetails US Patent