BDBM205367 US9249151, 13
SMILES CNC(C)C(=O)Nc1cc(cc(NC(=O)c2ccc(Cl)cn2)n1)-c1cccc2n(C)nc(C)c12
InChI Key InChIKey=QMYOVGLYSKKPJK-UHFFFAOYSA-N
Data  2 IC50
  Tab Delimited (TSV)   2D SDfile   Computed 3D by Vconf -m prep SDfile
Find this compound or compounds like it in BindingDB:
Activity Spreadsheet -- Enzyme Inhibition Constant Data from BindingDB
Found 2 hits for monomerid = 205367
TargetBaculoviral IAP repeat-containing protein 3 [256-363](Homo sapiens (Human))
Boehringer Ingelheim International
US Patent
LigandPNGBDBM205367(US9249151, 13)
Affinity DataIC50:  2nMT: 2°C. Assay description: R3 domains of human XIAP (covering amino acids 241 to 356; XIAP BIR3) and cIAPl (covering amino acids 256 to 363; cIAPl BIR3) were expressed and puri...
Ligand InfoPC cidPC sid
In DepthDetails US Patent
TargetE3 ubiquitin-protein ligase XIAP [241-356](Homo sapiens (Human))
Boehringer Ingelheim International
US Patent
LigandPNGBDBM205367(US9249151, 13)
Affinity DataIC50:  391nMT: 2°C. Assay description: R3 domains of human XIAP (covering amino acids 241 to 356; XIAP BIR3) and cIAPl (covering amino acids 256 to 363; cIAPl BIR3) were expressed and puri...
Ligand InfoPC cidPC sid
In DepthDetails US Patent