BDBM205385 US9249151, 31
SMILES CNC(C)C(=O)Nc1cc(cc(NC(=O)c2ncc3ccccc3n2)n1)-c1c(C)ccc2ncccc12
InChI Key InChIKey=AUIVGJBMEPRHDB-UHFFFAOYSA-N
Data  2 IC50
  Tab Delimited (TSV)   2D SDfile   Computed 3D by Vconf -m prep SDfile
Find this compound or compounds like it in BindingDB:
Activity Spreadsheet -- Enzyme Inhibition Constant Data from BindingDB
Found 2 hits for monomerid = 205385
TargetBaculoviral IAP repeat-containing protein 3 [256-363](Homo sapiens (Human))
Boehringer Ingelheim International
US Patent
LigandPNGBDBM205385(US9249151, 31)
Affinity DataIC50:  52nMT: 2°C. Assay description: R3 domains of human XIAP (covering amino acids 241 to 356; XIAP BIR3) and cIAPl (covering amino acids 256 to 363; cIAPl BIR3) were expressed and puri...
Ligand InfoPC cidPC sid
In DepthDetails US Patent
TargetE3 ubiquitin-protein ligase XIAP [241-356](Homo sapiens (Human))
Boehringer Ingelheim International
US Patent
LigandPNGBDBM205385(US9249151, 31)
Affinity DataIC50:  1.11E+3nMT: 2°C. Assay description: R3 domains of human XIAP (covering amino acids 241 to 356; XIAP BIR3) and cIAPl (covering amino acids 256 to 363; cIAPl BIR3) were expressed and puri...
Ligand InfoPC cidPC sid
In DepthDetails US Patent