BDBM205443 2S+IBET-PEG0 (23)
SMILES COC(=O)CC1N=C(c2c(C)c(sc2-n2c(C)nnc12)C(=O)NCCNC(=O)Cn1c2cnc3cc(-c4c(C)noc4C)c(OC)cc3c2n([C@H](C)c2ccccn2)c1=O)c1ccc(Cl)cc1
InChI Key InChIKey=VYSDIFXQJTUSHB-HSGLFRJESA-N
Data  2 IC50
  Tab Delimited (TSV)   2D SDfile   Computed 3D by Vconf -m prep SDfile
Find this compound or compounds like it in BindingDB:
Activity Spreadsheet -- Enzyme Inhibition Constant Data from BindingDB
Found 2 hits for monomerid = 205443
TargetBromodomain testis-specific protein [21-137](Homo sapiens (Human))
Dana-Farber Cancer Institute
LigandPNGBDBM205443(2S+IBET-PEG0 (23))
Affinity DataIC50:  596nMpH: 7.5 T: 2°C. Assay description: Assays were performed with minor modifications from the manufacturer's protocol (PerkinElmer, USA). All reagents were diluted in 50 mM HEPES, 150...
Ligand InfoPC cidPC sid
In DepthDetails ArticlePubMed
TargetBromodomain-containing protein 4 [44-168](Homo sapiens (Human))
Dana-Farber Cancer Institute
LigandPNGBDBM205443(2S+IBET-PEG0 (23))
Affinity DataIC50:  439nMpH: 7.5 T: 2°C. Assay description: Assays were performed with minor modifications from the manufacturer's protocol (PerkinElmer, USA). All reagents were diluted in 50 mM HEPES, 150...
Ligand InfoPC cidPC sid
In DepthDetails ArticlePubMed