BDBM205461 Salicyl-AMSN (4)
SMILES Nc1ncnc2n(cnc12)[C@@H]1O[C@H](CNS(=O)(=O)[N-]C(=O)c2ccccc2O)[C@@H](O)[C@H]1O
InChI Key InChIKey=KWPUPMDLRXZDCC-CNEMSGBDSA-M
Data  1 KI
  Tab Delimited (TSV)   2D SDfile   Computed 3D by Vconf -m prep SDfile
Find this compound or compounds like it in BindingDB:
Activity Spreadsheet -- Enzyme Inhibition Constant Data from BindingDB
Found 1 hit for monomerid = 205461
TargetAnthranilate--CoA ligase(Pseudomonas aeruginosa (Gram- Bacteria))
East Carolina University
LigandPNGBDBM205461(Salicyl-AMSN (4))
Affinity DataKi:  109nMpH: 8.0Assay Description:Reactions were performed at 37 °C in a 0.5 mL volume in a Varian Cary 100 UV-visible spectrophotometer with Cary WinUV software. Reaction mixtures co...
Ligand InfoPC cidPC sid
In DepthDetails ArticlePubMed