BDBM206293 N-((1-((4-oxo-2-phenyl-4H-chromen-6-yl)methyl)-1H-1,2,3-triazol-4-yl)methyl)benzamide (Az1k1)
SMILES O=C(NCc1cn(Cc2ccc3oc(cc(=O)c3c2)-c2ccccc2)nn1)c1ccccc1
InChI Key InChIKey=VGXBDMKMLQSIEZ-UHFFFAOYSA-N
Data  2 IC50
  Tab Delimited (TSV)   2D SDfile   Computed 3D by Vconf -m prep SDfile
Find this compound or compounds like it in BindingDB:
Activity Spreadsheet -- Enzyme Inhibition Constant Data from BindingDB
Found 2 hits for monomerid = 206293
TargetAmine oxidase [flavin-containing] B(Homo sapiens (Human))
Zhejiang University Of Technology
LigandPNGBDBM206293(N-((1-((4-oxo-2-phenyl-4H-chromen-6-yl)methyl)-1H-...)
Affinity DataIC50:  1.11E+5nM. Assay description: The inhibitory activities of flavones were determined in vitroby using fluorescent probe method following the general proceduredescribed in the liter...
Ligand InfoPC cidPC sid
In DepthDetails ArticlePubMed
TargetAmine oxidase [flavin-containing] A(Homo sapiens (Human))
Zhejiang University Of Technology
LigandPNGBDBM206293(N-((1-((4-oxo-2-phenyl-4H-chromen-6-yl)methyl)-1H-...)
Affinity DataIC50:  1.84E+5nM. Assay description: The inhibitory activities of flavones were determined in vitroby using fluorescent probe method following the general proceduredescribed in the liter...
Ligand InfoPC cidPC sid
In DepthDetails ArticlePubMed