BDBM206297 3-(1-((4-oxo-2-phenyl-4H-chromen-6-yl)methyl)-1H-1,2,3-triazol-4-yl)-N-(p-tolyl)propanamide (Az1k5)
SMILES Cc1ccc(NC(=O)CCc2cn(Cc3ccc4oc(cc(=O)c4c3)-c3ccccc3)nn2)cc1
InChI Key InChIKey=BLJGUCNAQPUJDO-UHFFFAOYSA-N
Data  2 IC50
  Tab Delimited (TSV)   2D SDfile   Computed 3D by Vconf -m prep SDfile
Find this compound or compounds like it in BindingDB:
Activity Spreadsheet -- Enzyme Inhibition Constant Data from BindingDB
Found 2 hits for monomerid = 206297
TargetAmine oxidase [flavin-containing] B(Homo sapiens (Human))
Zhejiang University Of Technology
LigandPNGBDBM206297(3-(1-((4-oxo-2-phenyl-4H-chromen-6-yl)methyl)-1H-1...)
Affinity DataIC50:  2.85E+4nM. Assay description: The inhibitory activities of flavones were determined in vitroby using fluorescent probe method following the general proceduredescribed in the liter...
Ligand InfoPC cidPC sid
In DepthDetails ArticlePubMed
TargetAmine oxidase [flavin-containing] A(Homo sapiens (Human))
Zhejiang University Of Technology
LigandPNGBDBM206297(3-(1-((4-oxo-2-phenyl-4H-chromen-6-yl)methyl)-1H-1...)
Affinity DataIC50:  2.53E+4nM. Assay description: The inhibitory activities of flavones were determined in vitroby using fluorescent probe method following the general proceduredescribed in the liter...
Ligand InfoPC cidPC sid
In DepthDetails ArticlePubMed