BDBM206314 6-((5-((3-hydroxyphenoxy)methyl)-1H-1,2,3-triazol-1-yl)methyl)-2-phenyl-4H-chromen-4-one (Az1k15)
SMILES Oc1cccc(OCc2cnnn2Cc2ccc3oc(cc(=O)c3c2)-c2ccccc2)c1
InChI Key InChIKey=MBSVSOFSGSMXIR-UHFFFAOYSA-N
Data  1 IC50
  Tab Delimited (TSV)   2D SDfile   Computed 3D by Vconf -m prep SDfile
Find this compound or compounds like it in BindingDB:
Activity Spreadsheet -- Enzyme Inhibition Constant Data from BindingDB
Found 1 hit for monomerid = 206314
TargetAmine oxidase [flavin-containing] B(Homo sapiens (Human))
Zhejiang University Of Technology
LigandPNGBDBM206314(6-((5-((3-hydroxyphenoxy)methyl)-1H-1,2,3-triazol-...)
Affinity DataIC50:  7.58E+4nM. Assay description: The inhibitory activities of flavones were determined in vitroby using fluorescent probe method following the general proceduredescribed in the liter...
Ligand InfoPC cidPC sid
In DepthDetails ArticlePubMed