BDBM20671 4-{[5-(2-methoxyacetamido)-2-methylphenyl]amino}-5-methyl-N-propylpyrrolo[1,2-a][1,2,4]triazine-6-carboxamide::pyrrolo[2,1-f][1,2,4]triazine analogue, 21e
SMILES CCCNC(=O)c1cn2ncnc(Nc3cc(NC(=O)COC)ccc3C)c2c1C
InChI Key InChIKey=JFZDUDLKSMDQJF-UHFFFAOYSA-N
Data  1 IC50  1 EC50
  Tab Delimited (TSV)   2D SDfile   Computed 3D by Vconf -m prep SDfile
Find this compound or compounds like it in BindingDB:
Activity Spreadsheet -- Enzyme Inhibition Constant Data from BindingDB
Found 1 hit for monomerid = 20671
TargetMitogen-activated protein kinase 14(Homo sapiens (Human))
Novartis Pharmaceuticals
LigandPNGBDBM20671(4-{[5-(2-methoxyacetamido)-2-methylphenyl]amino}-5...)
Affinity DataIC50:  20nM EC50:  43nM. Assay description: The kinase activity was determined by quantitation of the amount of radioactive phosphate transferred to myelin basic protein (MBP) with or without i...
In DepthDetails ArticlePubMed