BDBM20673 ethyl N-(3-{[6-(ethylcarbamoyl)-5-methylpyrrolo[1,2-a][1,2,4]triazin-4-yl]amino}-4-methylphenyl)carbamate::pyrrolo[2,1-f][1,2,4]triazine analogue, 21g
SMILES CCNC(=O)c1cn2ncnc(Nc3cc(NC(=O)OCC)ccc3C)c2c1C
InChI Key InChIKey=TXYONQXEBANMAS-UHFFFAOYSA-N
Data  1 IC50  1 EC50
  Tab Delimited (TSV)   2D SDfile   Computed 3D by Vconf -m prep SDfile
Find this compound or compounds like it in BindingDB:
Activity Spreadsheet -- Enzyme Inhibition Constant Data from BindingDB
Found 1 hit for monomerid = 20673
TargetMitogen-activated protein kinase 14(Homo sapiens (Human))
Novartis Pharmaceuticals
LigandPNGBDBM20673(ethyl N-(3-{[6-(ethylcarbamoyl)-5-methylpyrrolo[1,...)
Affinity DataIC50:  4.70nM EC50:  72nM. Assay description: The kinase activity was determined by quantitation of the amount of radioactive phosphate transferred to myelin basic protein (MBP) with or without i...
In DepthDetails ArticlePubMed