BDBM206935 US9233965, 11
SMILES Cc1cccc(c1)-c1c(C2CC2)n2CCN(Cc2c1C(N)=O)C(=O)NC(C)(C)C
InChI Key InChIKey=SXBLNSCZTXYAQX-UHFFFAOYSA-N
Data  1 IC50
  Tab Delimited (TSV)   2D SDfile   Computed 3D by Vconf -m prep SDfile
Find this compound or compounds like it in BindingDB:
Activity Spreadsheet -- Enzyme Inhibition Constant Data from BindingDB
Found 1 hit for monomerid = 206935
TargetCasein kinase I isoform epsilon(Homo sapiens (Human))
Sanofi
US Patent
LigandPNGBDBM206935(US9233965, 11)
Affinity DataIC50:  4nMpH: 7.5 T: 2°C. Assay description: "U"-bottomed Falcon plates are prepared by placing 5 uL of solutions of the compounds according to the invention at concentrations of 10, 1, 0.1, 0.0...
Ligand InfoPC cidPC sid
In DepthDetails US Patent