BDBM206986 US9233965, 55
SMILES COc1ccc(cc1)-c1c(C(N)=O)c2CN(CCn2c1C1CC1)C(=O)NCC12CC3CC(CC(C3)C1)C2
InChI Key InChIKey=YKMKYRBFBTYHEQ-UHFFFAOYSA-N
Data  1 IC50
  Tab Delimited (TSV)   2D SDfile   Computed 3D by Vconf -m prep SDfile
Find this compound or compounds like it in BindingDB:
Activity Spreadsheet -- Enzyme Inhibition Constant Data from BindingDB
Found 1 hit for monomerid = 206986
TargetCasein kinase I isoform epsilon(Homo sapiens (Human))
Sanofi
US Patent
LigandPNGBDBM206986(US9233965, 55)
Affinity DataIC50:  4nMpH: 7.5 T: 2°C. Assay description: "U"-bottomed Falcon plates are prepared by placing 5 uL of solutions of the compounds according to the invention at concentrations of 10, 1, 0.1, 0.0...
Ligand InfoPC cidPC sid
In DepthDetails US Patent