BDBM206993 US9233965, 73
SMILES CC(C)(CO)CNC(=O)N1CCn2c(Cl)c(c(C(N)=O)c2C1)-c1cccc(F)c1
InChI Key InChIKey=LIBXNJZFPQXGON-UHFFFAOYSA-N
Data  1 IC50
  Tab Delimited (TSV)   2D SDfile   Computed 3D by Vconf -m prep SDfile
Find this compound or compounds like it in BindingDB:
Activity Spreadsheet -- Enzyme Inhibition Constant Data from BindingDB
Found 1 hit for monomerid = 206993
TargetCasein kinase I isoform epsilon(Homo sapiens (Human))
Sanofi
US Patent
LigandPNGBDBM206993(US9233965, 73)
Affinity DataIC50:  6nMpH: 7.5 T: 2°C. Assay description: "U"-bottomed Falcon plates are prepared by placing 5 uL of solutions of the compounds according to the invention at concentrations of 10, 1, 0.1, 0.0...
Ligand InfoPC cidPC sid
In DepthDetails US Patent