BDBM207048 US9260439, 25
SMILES Nc1ncc(cn1)-c1nc(nc2N(CCc12)[C@H]1CCN(C1)C(=O)CO)N1CCOCC1
InChI Key InChIKey=HXEWXMOUPFBCDW-AWEZNQCLSA-N
Data  1 KI
  Tab Delimited (TSV)   2D SDfile   Computed 3D by Vconf -m prep SDfile
Find this compound or compounds like it in BindingDB:
Activity Spreadsheet -- Enzyme Inhibition Constant Data from BindingDB
Found 1 hit for monomerid = 207048
LigandPNGBDBM207048(US9260439, 25)
Affinity DataKi: <0.229nM. Assay description: PI3KA_FL: Genes encoding for full length p110alpha and p85alpha subunits of PI3Kalpha complex were subcloned from existing constructs into pFASTBAC D...
Ligand InfoPC cidPC sid
In DepthDetails US Patent