BDBM2073 8-Substituted Dipyridodiazepinone 14::methyl (2E)-3-{2-ethyl-9-methyl-10-oxo-2,4,9,15-tetraazatricyclo[9.4.0.0^{3,8}]pentadeca-1(11),3,5,7,12,14-hexaen-13-yl}prop-2-enoate
SMILES CCN1c2ncccc2N(C)C(=O)c2cc(\C=C\C(=O)OC)cnc12
InChI Key InChIKey=CQGZGOVBDYINLW-BQYQJAHWSA-N
Data  1 IC50
  Tab Delimited (TSV)   2D SDfile   Computed 3D by Vconf -m prep SDfile
Find this compound or compounds like it in BindingDB:
Activity Spreadsheet -- Enzyme Inhibition Constant Data from BindingDB
Found 1 hit for monomerid = 2073
TargetGag-Pol polyprotein [600-1027,R876K]/[600-1155](Human immunodeficiency virus type 1)
Boehringer Ingelheim Pharmaceuticals
LigandPNGBDBM2073(8-Substituted Dipyridodiazepinone 14 | methyl (2E)...)
Affinity DataIC50: >1.00E+3nMpH: 7.8 T: 2°C. Assay description: The IC50 of reverse transcriptase is the concentration that inhibits 50% of recombinant HIV-1 RT RNA-directed DNA polymerase activity in vitro.
In DepthDetails ArticlePubMed