BDBM207528 US9260439, 412
SMILES CC(C)(N)COC(=O)N1CC[C@@](C)(C1)N1CCc2c1nc(nc2-c1cnc(N)nc1)N1CCOCC1
InChI Key InChIKey=GSHQHRFFKJAJQY-DEOSSOPVSA-N
Data  1 KI
  Tab Delimited (TSV)   2D SDfile   Computed 3D by Vconf -m prep SDfile
Find this compound or compounds like it in BindingDB:
Activity Spreadsheet -- Enzyme Inhibition Constant Data from BindingDB
Found 1 hit for monomerid = 207528
LigandPNGBDBM207528(US9260439, 412)
Affinity DataKi: <0.0180nM. Assay description: PI3KA_Act: Genes encoding for full length p110alpha and p85alpha nSH-iSH2=niSH2 (p85a aminoacids 322-600) subunits of PI3Kalpha complex were subclone...
Ligand InfoPC cidPC sid
In DepthDetails US Patent