BDBM207561 US10501467, Example 6::US9260440, 6::US9617273, Example 6
SMILES CC(C)C1Cc2[nH]c3cccc4c3c2c(C1)n[nH]c4=O
InChI Key InChIKey=FPOSOKNSWGCIFX-UHFFFAOYSA-N
Data  9 IC50
  Tab Delimited (TSV)   2D SDfile   Computed 3D by Vconf -m prep SDfile
Find this compound or compounds like it in BindingDB:
Activity Spreadsheet -- Enzyme Inhibition Constant Data from BindingDB
Found 9 hits for monomerid = 207561
TargetPoly [ADP-ribose] polymerase 1(Homo sapiens (Human))
Beigene
US Patent
LigandPNGBDBM207561(US10501467, Example 6 | US9260440, 6 | US9617273, ...)
Affinity DataIC50:  6nMpH: 8.0Assay Description:PARP-1 enzymatic assay was conducted using a method modified from HT F Homogeneous PARP Inhibition Assay Kit (Trevigen). 8.8 nM PARP-1 was pre-incuba...
Ligand InfoPC cidPC sid
In DepthDetails US Patent
TargetPoly [ADP-ribose] polymerase 2(Homo sapiens (Human))
Beigene
US Patent
LigandPNGBDBM207561(US10501467, Example 6 | US9260440, 6 | US9617273, ...)
Affinity DataIC50:  1.10nM. Assay description: PARP-2 and PARP-3 enzymatic assays were conducted using commercial PARP-2/PARP-3 Chemiluminescent Assay Kit (BPS Biosciences) and the protocols with ...
Ligand InfoPC cidPC sid
In DepthDetails US Patent
TargetPoly [ADP-ribose] polymerase tankyrase-2(Homo sapiens (Human))
Beigene
US Patent
LigandPNGBDBM207561(US10501467, Example 6 | US9260440, 6 | US9617273, ...)
Affinity DataIC50:  80nM. Assay description: Tankyrase-2 enzymatic assay was conducted using commercial Tankyrase-2 Chemiluminescent Assay Kit (BPS Biosciences) and the protocol with the kit. GS...
Ligand InfoPC cidPC sid
In DepthDetails US Patent
TargetPoly [ADP-ribose] polymerase 1(Homo sapiens (Human))
Beigene
US Patent
LigandPNGBDBM207561(US10501467, Example 6 | US9260440, 6 | US9617273, ...)
Affinity DataIC50:  6.00E+3nM. Assay description: PARP-1 enzymatic assay was conducted using a method modified from HT F Homogeneous PARP Inhibition Assay Kit (Trevigen). 8.8 nM PARP-1 was pre-incuba...
Ligand InfoPC cidPC sid
In DepthDetails US Patent
TargetPoly [ADP-ribose] polymerase tankyrase-2(Homo sapiens (Human))
Beigene
US Patent
LigandPNGBDBM207561(US10501467, Example 6 | US9260440, 6 | US9617273, ...)
Affinity DataIC50:  8.00E+4nM. Assay description: Tankyrase-2 enzymatic assay was conducted using commercial Tankyrase-2 Chemiluminescent Assay Kit (BPS Biosciences) and the protocol with the kit. GS...
Ligand InfoPC cidPC sid
In DepthDetails US Patent
TargetPoly [ADP-ribose] polymerase tankyrase-2(Homo sapiens (Human))
Beigene
US Patent
LigandPNGBDBM207561(US10501467, Example 6 | US9260440, 6 | US9617273, ...)
Affinity DataIC50:  8.00E+4nM. Assay description: Tankyrase-2 enzymatic assay was conducted using commercial Tankyrase-2 Chemiluminescent Assay Kit (BPS Biosciences) and the protocol with the kit. GS...
Ligand InfoPC cidPC sid
In DepthDetails US Patent
TargetPoly [ADP-ribose] polymerase 1(Homo sapiens (Human))
Beigene
US Patent
LigandPNGBDBM207561(US10501467, Example 6 | US9260440, 6 | US9617273, ...)
Affinity DataIC50:  6.00E+3nM. Assay description: PARP-1 enzymatic assay was conducted using a method modified from HT F Homogeneous PARP Inhibition Assay Kit (Trevigen). 8.8 nM PARP-1 was pre-incuba...
Ligand InfoPC cidPC sid
In DepthDetails US Patent
TargetPoly [ADP-ribose] polymerase 2(Homo sapiens (Human))
Beigene
US Patent
LigandPNGBDBM207561(US10501467, Example 6 | US9260440, 6 | US9617273, ...)
Affinity DataIC50:  1.10E+3nM. Assay description: PARP-2 and PARP-3 enzymatic assays were conducted using commercial PARP-2/PARP-3 Chemiluminescent Assay Kit (BPS Biosciences) and the protocols with ...
Ligand InfoPC cidPC sid
In DepthDetails US Patent
TargetPoly [ADP-ribose] polymerase 2(Homo sapiens (Human))
Beigene
US Patent
LigandPNGBDBM207561(US10501467, Example 6 | US9260440, 6 | US9617273, ...)
Affinity DataIC50:  1.10E+3nM. Assay description: PARP-2 and PARP-3 enzymatic assays were conducted using commercial PARP-2/PARP-3 Chemiluminescent Assay Kit (BPS Biosciences) and the protocols with ...
Ligand InfoPC cidPC sid
In DepthDetails US Patent