BDBM207766 US9265734, R46
SMILES CCOc1ccc2[nH]c(cc2c1)C(=O)NCCCCCC(=O)Nc1ccccc1N
InChI Key InChIKey=DPHJEUKXOAQYEM-UHFFFAOYSA-N
Data  2 IC50
  Tab Delimited (TSV)   2D SDfile   Computed 3D by Vconf -m prep SDfile
Find this compound or compounds like it in BindingDB:
Activity Spreadsheet -- Enzyme Inhibition Constant Data from BindingDB
Found 2 hits for monomerid = 207766
TargetHistone deacetylase 3(Homo sapiens (Human))
Biomarin Pharmaceutical
US Patent
LigandPNGBDBM207766(US9265734, R46)
Affinity DataIC50:  49nM. Assay description: HDAC enzyme inhibition assays were performed using purified HDACs 1-10 essentially as described in Beckers et al., 2007, Int. J. Cancer., 121:1138-48...
Ligand InfoPC cidPC sid
In DepthDetails US Patent
TargetHistone deacetylase 1(Homo sapiens (Human))
Biomarin Pharmaceutical
US Patent
LigandPNGBDBM207766(US9265734, R46)
Affinity DataIC50:  359nM. Assay description: HDAC enzyme inhibition assays were performed using purified HDACs 1-10 essentially as described in Beckers et al., 2007, Int. J. Cancer., 121:1138-48...
Ligand InfoPC cidPC sid
In DepthDetails US Patent