BDBM20801 2-[(2-amino-6-chloro-9H-purin-9-yl)methyl]-3,5-dimethylpyridin-4-ol::2-amino-6-halopurine analogue, 21
SMILES Cc1cnc(Cn2cnc3c(Cl)nc(N)nc23)c(C)c1O
InChI Key InChIKey=UBBCAAXVXOVGLY-UHFFFAOYSA-N
Data  1 EC50
  Tab Delimited (TSV)   2D SDfile   Computed 3D by Vconf -m prep SDfile
Find this compound or compounds like it in BindingDB:
Activity Spreadsheet -- Enzyme Inhibition Constant Data from BindingDB
Found 1 hit for monomerid = 20801
TargetHeat shock protein HSP 90-beta(Homo sapiens (Human))
Biogen Idec
LigandPNGBDBM20801(2-[(2-amino-6-chloro-9H-purin-9-yl)methyl]-3,5-dim...)
Affinity DataEC50:  1.00E+5nMpH: 7.2 T: 2°C. Assay description: EC50 was defined as the concentration of the compound at which there was 50% degradation of the Her-2/neu protein in MCF7 breast carcinoma cells. Sam...
In DepthDetails ArticlePubMed