BDBM2081 2-ethyl-9-methyl-13-[2-(pyridin-3-yl)ethyl]-2,4,9,15-tetraazatricyclo[9.4.0.0^{3,8}]pentadeca-1(11),3,5,7,12,14-hexaen-10-one::8-Arylethyl Dipyridodiazepinone 22
SMILES CCN1c2ncccc2N(C)C(=O)c2cc(CCc3cccnc3)cnc12
InChI Key InChIKey=SHONGYQWPMGFBR-UHFFFAOYSA-N
Data  3 IC50
  Tab Delimited (TSV)   2D SDfile   Computed 3D by Vconf -m prep SDfile
Find this compound or compounds like it in BindingDB:
Activity Spreadsheet -- Enzyme Inhibition Constant Data from BindingDB
Found 3 hits for monomerid = 2081
TargetGag-Pol polyprotein [600-1027,R876K]/[600-1155](Human immunodeficiency virus type 1)
Boehringer Ingelheim Pharmaceuticals
LigandPNGBDBM2081(2-ethyl-9-methyl-13-[2-(pyridin-3-yl)ethyl]-2,4,9,...)
Affinity DataIC50:  30nM. Assay description: The IC50 of reverse transcriptase is the concentration that inhibits 50% of recombinant HIV-1 RT RNA-directed DNA polymerase activity in vitro.
In DepthDetails ArticlePubMed
TargetGag-Pol polyprotein [600-1027,Y787L]/[600-1155,Y787L](Human immunodeficiency virus type 1)
Boehringer Ingelheim Pharmaceuticals
LigandPNGBDBM2081(2-ethyl-9-methyl-13-[2-(pyridin-3-yl)ethyl]-2,4,9,...)
Affinity DataIC50: >1.00E+3nM. Assay description: The IC50 of reverse transcriptase is the concentration that inhibits 50% of recombinant HIV-1 RT RNA-directed DNA polymerase activity in vitro.
In DepthDetails ArticlePubMed
TargetGag-Pol polyprotein [600-1027,Y780C]/[600-1155,Y780C](Human immunodeficiency virus type 1)
Boehringer Ingelheim Pharmaceuticals
LigandPNGBDBM2081(2-ethyl-9-methyl-13-[2-(pyridin-3-yl)ethyl]-2,4,9,...)
Affinity DataIC50:  110nM. Assay description: The IC50 of reverse transcriptase is the concentration that inhibits 50% of recombinant HIV-1 RT RNA-directed DNA polymerase activity in vitro.
In DepthDetails ArticlePubMed