BDBM208519 US9266870, 35
SMILES Cc1ccc(c(c1)C(=O)N1CCCOC1Cn1cc(cn1)-c1ccc(F)cc1)-n1nccn1
InChI Key InChIKey=AQFPGDOPAWNDQW-UHFFFAOYSA-N
Data  2 IC50
  Tab Delimited (TSV)   2D SDfile   Computed 3D by Vconf -m prep SDfile
Find this compound or compounds like it in BindingDB:
Activity Spreadsheet -- Enzyme Inhibition Constant Data from BindingDB
Found 2 hits for monomerid = 208519
TargetOrexin receptor type 2(Homo sapiens (Human))
Taisho Pharmaceutical
US Patent
LigandPNGBDBM208519(US9266870, 35)
Affinity DataIC50:  1nMpH: 7.4 T: 2°C. Assay description: The antagonistic activities of the test compounds on human orexin-1 receptor (hOX1R) and orexin-2 receptor (hOX2R) were measured by modifying from th...
Ligand InfoPC cidPC sid
In DepthDetails US Patent
TargetOrexin/Hypocretin receptor type 1(Homo sapiens (Human))
Taisho Pharmaceutical
US Patent
LigandPNGBDBM208519(US9266870, 35)
Affinity DataIC50:  0.800nMpH: 7.4 T: 2°C. Assay description: The antagonistic activities of the test compounds on human orexin-1 receptor (hOX1R) and orexin-2 receptor (hOX2R) were measured by modifying from th...
Ligand InfoPC cidPC sid
In DepthDetails US Patent