BDBM208771 US9266876, 238
SMILES C[C@@H]1CN(CCN1C(=O)Cn1nc(C)nc1C)c1sc(nc1-c1nc2ccc(cc2[nH]1)C1CCOCC1)C(F)(F)F
InChI Key InChIKey=VJHWXFTZYDAOIA-OAHLLOKOSA-N
Data  3 IC50
  Tab Delimited (TSV)   2D SDfile   Computed 3D by Vconf -m prep SDfile
Find this compound or compounds like it in BindingDB:
Activity Spreadsheet -- Enzyme Inhibition Constant Data from BindingDB
Found 3 hits for monomerid = 208771
TargetC-X-C chemokine receptor type 3/Guanine nucleotide-binding protein subunit alpha-15(Homo sapiens (Human))
Actelion Pharmaceuticals
US Patent
LigandPNGBDBM208771(US9266876, 238)
Affinity DataIC50:  1nMpH: 7.4 T: 2°C. Assay description: The bioactivity of compounds is tested in a fluorometric imaging plate reader (FLIPR: Molecular Devices) using engineered CHO-K1 cells expressing the...
Ligand InfoPC cidPC sid
In DepthDetails US Patent
TargetC-X-C chemokine receptor type 3(Homo sapiens (Human))
Idorsia Pharmaceuticals
Curated by ChEMBL
LigandPNGBDBM208771(US9266876, 238)
Affinity DataIC50:  123nM. Assay description: Antagonist activity at human recombinant CXCR3 in human venous blood assessed as receptor internalization measured for 30 mins in presence of CXCL10 ...
Ligand InfoPC cidPC sid
In DepthDetails PubMed
TargetC-X-C chemokine receptor type 3(Homo sapiens (Human))
Idorsia Pharmaceuticals
Curated by ChEMBL
LigandPNGBDBM208771(US9266876, 238)
Affinity DataIC50:  3.30nM. Assay description: Antagonist activity at human recombinant CXCR3 expressed in CHO-K1 cells measured after 10 mins in presence of CXCL10 by FLIPR analysis
Ligand InfoPC cidPC sid
In DepthDetails PubMed