BDBM209139 US9266877, 85
SMILES Cc1c(cnn1CC1CCC2CC(C1)C2(C)C)-c1ccc(nc1C(O)=O)N1CCc2cccc(C(=O)Nc3nc4ccccc4s3)c2C1
InChI Key InChIKey=OHXHWBFNCAGNLJ-UHFFFAOYSA-N
Data  1 KI  1 EC50
  Tab Delimited (TSV)   2D SDfile   Computed 3D by Vconf -m prep SDfile
Find this compound or compounds like it in BindingDB:
Activity Spreadsheet -- Enzyme Inhibition Constant Data from BindingDB
Found 2 hits for monomerid = 209139
TargetBcl-2-like protein 1(Homo sapiens (Human))
Abbvie
US Patent
LigandPNGBDBM209139(US9266877, 85)
Affinity DataKi:  0.700nM ΔG°:  -12.5kcal/moleT: 2°C. Assay description: The measurement of competition of compounds of Formula (I) with F-Bak for a Bcl-2 family protein (Bcl-xL) binding site using a Time Resolved Fluoresc...
Ligand InfoPC cidPC sid
In DepthDetails US Patent
TargetBcl-2-like protein 1(Mus musculus (Mouse))
Abbvie
US Patent
LigandPNGBDBM209139(US9266877, 85)
Affinity DataEC50:  12nM. Assay description: The efficacy of the compounds of Formula (I) can also be determined in cell-based killing assays using a variety of cell lines and mouse tumor models...
Ligand InfoPC cidPC sid
In DepthDetails US Patent