BDBM20918 5-(2,4-dihydroxy-5-phenylphenyl)-N-ethyl-4-[4-(morpholin-4-ylmethyl)phenyl]-1,2-oxazole-3-carboxamide::Isoxazole, 40c::US10413550, Example 74::US11234987, Example 74::US9718793, 74
SMILES CCNC(=O)c1noc(c1-c1ccc(CN2CCOCC2)cc1)-c1cc(c(O)cc1O)-c1ccccc1
InChI Key InChIKey=IFYJCWYDVYZPLI-UHFFFAOYSA-N
Data  4 IC50  1 Kd  1 EC50
  Tab Delimited (TSV)   2D SDfile   Computed 3D by Vconf -m prep SDfile
Find this compound or compounds like it in BindingDB:
Activity Spreadsheet -- Enzyme Inhibition Constant Data from BindingDB
Found 5 hits for monomerid = 20918
TargetHeat shock protein HSP 90-beta(Homo sapiens (Human))
Vernalis (R&D)
LigandPNGBDBM20918(5-(2,4-dihydroxy-5-phenylphenyl)-N-ethyl-4-[4-(mor...)
Affinity DataIC50:  22nM EC50:  152nM. Assay description: The assay is based upon displacement of a fluorescently labeled molecule, which binds specifically to the ATP-binding site of full-length human Hsp90...
In DepthDetails ArticlePubMed
TargetHeat shock protein HSP 90-alpha(Homo sapiens (Human))
The Institute Of Cancer Research
US Patent
LigandPNGBDBM20918(5-(2,4-dihydroxy-5-phenylphenyl)-N-ethyl-4-[4-(mor...)
Affinity DataIC50: <1.00E+4nM. Assay description: Fluorescence polarization {also known as fluorescence anisotropy} measures the rotation of a fluorescing species in solution, where the larger molecu...
In DepthDetails US Patent
TargetHeat shock protein HSP 90-alpha/90-beta(Homo sapiens (Human))
Shenyang Pharmaceutical University
Curated by ChEMBL
LigandPNGBDBM20918(5-(2,4-dihydroxy-5-phenylphenyl)-N-ethyl-4-[4-(mor...)
Affinity DataKd: >2.50E+4nM. Assay description: Binding affinity to human Hsp90 expressed in Escherichia coli by SPR assay
In DepthDetails PubMed
TargetATP-dependent molecular chaperone HSP82(Saccharomyces cerevisiae)
Cancer Research Technology
US Patent
LigandPNGBDBM20918(5-(2,4-dihydroxy-5-phenylphenyl)-N-ethyl-4-[4-(mor...)
Affinity DataIC50: <1.00E+4nM. Assay description: 1) Costar 96-well black assay plate. Assay buffer of (a) 100 mM Tris pH7.4; (b) 20 mM KCl; (c) 6 mM MgCl2. Stored at room temperature.3) BSA (bovine ...
In DepthDetails US Patent
TargetEndoplasmin/Heat shock protein 75/Heat shock protein HSP 90-alpha/Heat shock protein HSP 90-beta(Homo sapiens (Human))
The Institute Of Cancer Research
US Patent
LigandPNGBDBM20918(5-(2,4-dihydroxy-5-phenylphenyl)-N-ethyl-4-[4-(mor...)
Affinity DataIC50: <1.00E+4nM. Assay description:  (1) Greiner 384-well (Greiner 781101) or Costar 384-well flat-bottomed polystyrene multiwell plates (VWR). (2) Assay buffer of (a) 100 mM Tris...
In DepthDetails US Patent