BDBM20931 Isoxazole, 71::N-ethyl-5-(5-ethyl-4-hydroxy-2-methoxyphenyl)-4-[4-(morpholin-4-ylmethyl)phenyl]-1,2-oxazole-3-carboxamide
SMILES CCNC(=O)c1noc(c1-c1ccc(CN2CCOCC2)cc1)-c1cc(CC)c(O)cc1OC
InChI Key InChIKey=JQMGJSXGRAGDCL-UHFFFAOYSA-N
Data  1 IC50  1 EC50
  Tab Delimited (TSV)   2D SDfile   Computed 3D by Vconf -m prep SDfile
Find this compound or compounds like it in BindingDB:
Activity Spreadsheet -- Enzyme Inhibition Constant Data from BindingDB
Found 1 hit for monomerid = 20931
TargetHeat shock protein HSP 90-beta(Homo sapiens (Human))
Vernalis (R&D)
LigandPNGBDBM20931(Isoxazole, 71 | N-ethyl-5-(5-ethyl-4-hydroxy-2-met...)
Affinity DataIC50:  540nM EC50:  2.15E+3nM. Assay description: The assay is based upon displacement of a fluorescently labeled molecule, which binds specifically to the ATP-binding site of full-length human Hsp90...
In DepthDetails ArticlePubMed