BDBM209402 US9266890, I-12
SMILES COc1cc(ccc1Nc1ncc2N(C)C(=O)CCN(C3CCCC3)c2n1)N1CCN(CCO)CC1
InChI Key InChIKey=POBSLBATAWVCHO-UHFFFAOYSA-N
Data  1 Kd
  Tab Delimited (TSV)   2D SDfile   Computed 3D by Vconf -m prep SDfile
Find this compound or compounds like it in BindingDB:
Activity Spreadsheet -- Enzyme Inhibition Constant Data from BindingDB
Found 1 hit for monomerid = 209402
TargetSerine/threonine-protein kinase PLK1(Homo sapiens (Human))
Dana-Farber Cancer Institute
US Patent
LigandPNGBDBM209402(US9266890, I-12)
Affinity DataKd:  8nM. Assay description: In vitro Plk1 binding assay: Ambit Kd values in nanomolar. Kd values generated by Ambit binding assay over a concentration range of the compound.
Ligand InfoPC cidPC sid
In DepthDetails US Patent