BDBM209538 US9271969, 26
SMILES OC(=O)C[C@H]1CCC(CC1)c1ccc(cc1)-c1ccc2nc(cn2c1)C(=O)NCc1ccc2OCCCOc2c1
InChI Key InChIKey=SADCEZRXVQTSMC-VGJLGSEPSA-N
Data  2 IC50
  Tab Delimited (TSV)   2D SDfile   Computed 3D by Vconf -m prep SDfile
Find this compound or compounds like it in BindingDB:
Activity Spreadsheet -- Enzyme Inhibition Constant Data from BindingDB
Found 2 hits for monomerid = 209538
TargetDiacylglycerol O-acyltransferase 1(Mus musculus (mouse))
Kainos Medicine
US Patent
LigandPNGBDBM209538(US9271969, 26)
Affinity DataIC50:  9.90nMpH: 7.4 T: 2°C. Assay description:  Assay buffer [20 mM HEPES (pH 7.4), 100 mM MgCl2 and 0.04% bovine serum albumin (BSA)] containing 500 uM of enzyme substrate (didecanoyl glycerol) ...
Ligand InfoPC cidPC sid
In DepthDetails US Patent
TargetDiacylglycerol O-acyltransferase 1(Homo sapiens (Human))
Kainos Medicine
US Patent
LigandPNGBDBM209538(US9271969, 26)
Affinity DataIC50:  29.5nMpH: 7.4 T: 2°C. Assay description:  Assay buffer [20 mM HEPES (pH 7.4), 100 mM MgCl2 and 0.04% bovine serum albumin (BSA)] containing 500 uM of enzyme substrate (didecanoyl glycerol) ...
Ligand InfoPC cidPC sid
In DepthDetails US Patent