BDBM210000 US10576087, Compound 2.6::US9273046, 2.6::US9895376, Compound 2.6
SMILES O=C1CCc2c(Oc3ccc4OC5C(C5c4c3)c3nc4ccc(cc4[nH]3)C#N)ccnc2N1
InChI Key
Data  6 IC50
  Tab Delimited (TSV)   2D SDfile   Computed 3D by Vconf -m prep SDfile
Find this compound or compounds like it in BindingDB:
Activity Spreadsheet -- Enzyme Inhibition Constant Data from BindingDB
Found 6 hits for monomerid = 210000
TargetSerine/threonine-protein kinase B-raf(Homo sapiens (Human))
Beigene
US Patent
LigandPNGBDBM210000(US10576087, Compound 2.6 | US9273046, 2.6 | US9895...)
Affinity DataIC50:  22nMT: 2°C. Assay description: Compounds disclosed herein were tested against B-Raf (V600E) (PV3849, from Invitrogen) or C-Raf (Y340D/Y341D) (PV3805, from Invitrogen) in a time-res...
Ligand InfoPC cidPC sid
In DepthDetails US Patent
TargetRAF proto-oncogene serine/threonine-protein kinase(Homo sapiens (Human))
Beigene
US Patent
LigandPNGBDBM210000(US10576087, Compound 2.6 | US9273046, 2.6 | US9895...)
Affinity DataIC50:  4.5nMT: 2°C. Assay description: Compounds disclosed herein were tested against B-Raf (V600E) (PV3849, from Invitrogen) or C-Raf (Y340D/Y341D) (PV3805, from Invitrogen) in a time-res...
Ligand InfoPC cidPC sid
In DepthDetails US Patent
LigandPNGBDBM210000(US10576087, Compound 2.6 | US9273046, 2.6 | US9895...)
Affinity DataIC50:  4.5nM. Assay description: Compounds disclosed herein were tested against B-Raf (V600E) (PV3849, from Invitrogen) or C-Raf (Y340D/Y341D) (PV3805, from Invitrogen) in a time-res...
Ligand InfoPC cidPC sid
In DepthDetails US Patent
TargetRAF proto-oncogene serine/threonine-protein kinase [Y340D,Y341D](Homo sapiens (Human))
Beigene
US Patent
LigandPNGBDBM210000(US10576087, Compound 2.6 | US9273046, 2.6 | US9895...)
Affinity DataIC50:  4.5nM. Assay description: Compounds disclosed herein were tested against B-Raf (V600E) (PV3849, from Invitrogen) or C-Raf (Y340D/Y341D) (PV3805, from Invitrogen) in a time-res...
Ligand InfoPC cidPC sid
In DepthDetails US Patent
TargetSerine/threonine-protein kinase B-raf [V600E](Homo sapiens (Human))
Beigene
US Patent
LigandPNGBDBM210000(US10576087, Compound 2.6 | US9273046, 2.6 | US9895...)
Affinity DataIC50:  22nM. Assay description: Compounds disclosed herein were tested against B-Raf (V600E) (PV3849, from Invitrogen) or C-Raf (Y340D/Y341D) (PV3805, from Invitrogen) in a time-res...
Ligand InfoPC cidPC sid
In DepthDetails US Patent
TargetSerine/threonine-protein kinase B-raf [V600E](Homo sapiens (Human))
Beigene
US Patent
LigandPNGBDBM210000(US10576087, Compound 2.6 | US9273046, 2.6 | US9895...)
Affinity DataIC50:  22nM. Assay description: Compounds disclosed herein were tested against B-Raf (V600E) (PV3849, from Invitrogen) or C-Raf (Y340D/Y341D) (PV3805, from Invitrogen) in a time-res...
Ligand InfoPC cidPC sid
In DepthDetails US Patent