BDBM210006 US10576087, Compound 2.12::US9273046, 2.12::US9895376, Compound 2.12
SMILES Clc1ccc2nc([nH]c2c1)C1C2Oc3ccc(Oc4ccnc5NC(=O)CCc45)cc3C12
InChI Key
Data  6 IC50
  Tab Delimited (TSV)   2D SDfile   Computed 3D by Vconf -m prep SDfile
Find this compound or compounds like it in BindingDB:
Activity Spreadsheet -- Enzyme Inhibition Constant Data from BindingDB
Found 6 hits for monomerid = 210006
TargetSerine/threonine-protein kinase B-raf(Homo sapiens (Human))
Beigene
US Patent
LigandPNGBDBM210006(US10576087, Compound 2.12 | US9273046, 2.12 | US98...)
Affinity DataIC50:  12nMT: 2°C. Assay description: Compounds disclosed herein were tested against B-Raf (V600E) (PV3849, from Invitrogen) or C-Raf (Y340D/Y341D) (PV3805, from Invitrogen) in a time-res...
Ligand InfoPC cidPC sid
In DepthDetails US Patent
TargetRAF proto-oncogene serine/threonine-protein kinase(Homo sapiens (Human))
Beigene
US Patent
LigandPNGBDBM210006(US10576087, Compound 2.12 | US9273046, 2.12 | US98...)
Affinity DataIC50:  4.10nMT: 2°C. Assay description: Compounds disclosed herein were tested against B-Raf (V600E) (PV3849, from Invitrogen) or C-Raf (Y340D/Y341D) (PV3805, from Invitrogen) in a time-res...
Ligand InfoPC cidPC sid
In DepthDetails US Patent
LigandPNGBDBM210006(US10576087, Compound 2.12 | US9273046, 2.12 | US98...)
Affinity DataIC50:  4.10nM. Assay description: Compounds disclosed herein were tested against B-Raf (V600E) (PV3849, from Invitrogen) or C-Raf (Y340D/Y341D) (PV3805, from Invitrogen) in a time-res...
Ligand InfoPC cidPC sid
In DepthDetails US Patent
TargetRAF proto-oncogene serine/threonine-protein kinase [Y340D,Y341D](Homo sapiens (Human))
Beigene
US Patent
LigandPNGBDBM210006(US10576087, Compound 2.12 | US9273046, 2.12 | US98...)
Affinity DataIC50:  4.10nM. Assay description: Compounds disclosed herein were tested against B-Raf (V600E) (PV3849, from Invitrogen) or C-Raf (Y340D/Y341D) (PV3805, from Invitrogen) in a time-res...
Ligand InfoPC cidPC sid
In DepthDetails US Patent
TargetSerine/threonine-protein kinase B-raf [V600E](Homo sapiens (Human))
Beigene
US Patent
LigandPNGBDBM210006(US10576087, Compound 2.12 | US9273046, 2.12 | US98...)
Affinity DataIC50:  12nM. Assay description: Compounds disclosed herein were tested against B-Raf (V600E) (PV3849, from Invitrogen) or C-Raf (Y340D/Y341D) (PV3805, from Invitrogen) in a time-res...
Ligand InfoPC cidPC sid
In DepthDetails US Patent
TargetSerine/threonine-protein kinase B-raf [V600E](Homo sapiens (Human))
Beigene
US Patent
LigandPNGBDBM210006(US10576087, Compound 2.12 | US9273046, 2.12 | US98...)
Affinity DataIC50:  12nM. Assay description: Compounds disclosed herein were tested against B-Raf (V600E) (PV3849, from Invitrogen) or C-Raf (Y340D/Y341D) (PV3805, from Invitrogen) in a time-res...
Ligand InfoPC cidPC sid
In DepthDetails US Patent