BDBM210050 US10576087, Compound 2.28::US9273046, 2.28
SMILES O=C1CCc2c(Oc3ccc4OC5C(C5c4c3)c3nc4ccc(cc4[nH]3)-c3ccccc3)ccnc2N1
InChI Key
Data  4 IC50
  Tab Delimited (TSV)   2D SDfile   Computed 3D by Vconf -m prep SDfile
Find this compound or compounds like it in BindingDB:
Activity Spreadsheet -- Enzyme Inhibition Constant Data from BindingDB
Found 4 hits for monomerid = 210050
TargetSerine/threonine-protein kinase B-raf(Homo sapiens (Human))
Beigene
US Patent
LigandPNGBDBM210050(US10576087, Compound 2.28 | US9273046, 2.28)
Affinity DataIC50:  232nMT: 2°C. Assay description: Compounds disclosed herein were tested against B-Raf (V600E) (PV3849, from Invitrogen) or C-Raf (Y340D/Y341D) (PV3805, from Invitrogen) in a time-res...
Ligand InfoPC cidPC sid
In DepthDetails US Patent
LigandPNGBDBM210050(US10576087, Compound 2.28 | US9273046, 2.28)
Affinity DataIC50:  81nM. Assay description: Compounds disclosed herein were tested against B-Raf (V600E) (PV3849, from Invitrogen) or C-Raf (Y340D/Y341D) (PV3805, from Invitrogen) in a time-res...
Ligand InfoPC cidPC sid
In DepthDetails US Patent
TargetSerine/threonine-protein kinase B-raf [V600E](Homo sapiens (Human))
Beigene
US Patent
LigandPNGBDBM210050(US10576087, Compound 2.28 | US9273046, 2.28)
Affinity DataIC50:  232nM. Assay description: Compounds disclosed herein were tested against B-Raf (V600E) (PV3849, from Invitrogen) or C-Raf (Y340D/Y341D) (PV3805, from Invitrogen) in a time-res...
Ligand InfoPC cidPC sid
In DepthDetails US Patent
TargetRAF proto-oncogene serine/threonine-protein kinase(Homo sapiens (Human))
Beigene
US Patent
LigandPNGBDBM210050(US10576087, Compound 2.28 | US9273046, 2.28)
Affinity DataIC50:  81nMT: 2°C. Assay description: Compounds disclosed herein were tested against B-Raf (V600E) (PV3849, from Invitrogen) or C-Raf (Y340D/Y341D) (PV3805, from Invitrogen) in a time-res...
Ligand InfoPC cidPC sid
In DepthDetails US Patent