BDBM21080 3-[4-(3-amino-1,2-benzoxazol-4-yl)phenyl]-1-phenylurea::Aminobenzoisoxazole, 23
SMILES Nc1noc2cccc(-c3ccc(NC(=O)Nc4ccccc4)cc3)c12
InChI Key InChIKey=SFNDRKNZETUTKF-UHFFFAOYSA-N
Data  3 IC50  1 EC50
  Tab Delimited (TSV)   2D SDfile   Computed 3D by Vconf -m prep SDfile
Find this compound or compounds like it in BindingDB:
Activity Spreadsheet -- Enzyme Inhibition Constant Data from BindingDB
Found 3 hits for monomerid = 21080
TargetMast/stem cell growth factor receptor Kit(Homo sapiens (Human))
Abbott Laboratories
LigandPNGBDBM21080(3-[4-(3-amino-1,2-benzoxazol-4-yl)phenyl]-1-phenyl...)
Affinity DataIC50:  18nM. Assay description: The assay uses purified enzyme interacting with biotinylated peptide substrate. HTRF is based on the proximity of europium cryptate (donor fluorophor...
In DepthDetails ArticlePubMed
TargetVascular endothelial growth factor receptor 2(Homo sapiens (Human))
Abbott Laboratories
LigandPNGBDBM21080(3-[4-(3-amino-1,2-benzoxazol-4-yl)phenyl]-1-phenyl...)
Affinity DataIC50:  23nM EC50:  25nMpH: 7.5 T: 2°C. Assay description: The assay uses purified enzyme interacting with biotinylated peptide substrate. HTRF is based on the proximity of europium cryptate (donor fluorophor...
In DepthDetails ArticlePubMed
TargetAromatase(Homo sapiens (Human))
Abbott Laboratories
LigandPNGBDBM21080(3-[4-(3-amino-1,2-benzoxazol-4-yl)phenyl]-1-phenyl...)
Affinity DataIC50:  7nM. Assay description: The assay uses purified enzyme interacting with biotinylated peptide substrate. HTRF is based on the proximity of europium cryptate (donor fluorophor...
In DepthDetails ArticlePubMed