BDBM210815 US10463663, Example 53::US11129828, Example 53::US9290456, 53::US9931340, Example 53
SMILES Oc1cc(CCc2c(F)cccc2F)n[nH]c1=O
InChI Key InChIKey=MEHHCHANLDGBCP-UHFFFAOYSA-N
Data  4 IC50
  Tab Delimited (TSV)   2D SDfile   Computed 3D by Vconf -m prep SDfile
Find this compound or compounds like it in BindingDB:
Activity Spreadsheet -- Enzyme Inhibition Constant Data from BindingDB
Found 4 hits for monomerid = 210815
TargetD-amino-acid oxidase(Homo sapiens (Human))
Takeda Pharmaceutical
US Patent
LigandPNGBDBM210815(US10463663, Example 53 | US11129828, Example 53 | ...)
Affinity DataIC50:  19nMpH: 7.4 T: 2°C. Assay description: Human DAAO enzyme was supplied by the Takeda Pharmaceutical Company (Osaka) and each batch was tested and used at concentrations giving comparable le...
Ligand InfoPC cidPC sid
In DepthDetails US Patent
TargetD-amino-acid oxidase(Homo sapiens (Human))
Takeda Pharmaceutical
US Patent
LigandPNGBDBM210815(US10463663, Example 53 | US11129828, Example 53 | ...)
Affinity DataIC50:  19nM. Assay description: Human DAAO enzyme was supplied by the Takeda Pharmaceutical Company (Osaka) and each batch was tested and used at concentrations giving comparable le...
Ligand InfoPC cidPC sid
In DepthDetails US Patent
TargetD-amino-acid oxidase(Homo sapiens (Human))
Takeda Pharmaceutical
US Patent
LigandPNGBDBM210815(US10463663, Example 53 | US11129828, Example 53 | ...)
Affinity DataIC50:  19nM. Assay description: The functional activity of compounds inhibiting the DAAO enzyme was determined by utilizing the co-product of the catalysis of D-Serine, H2O2 which c...
Ligand InfoPC cidPC sid
In DepthDetails US Patent
TargetD-amino-acid oxidase(Homo sapiens (Human))
Takeda Pharmaceutical
US Patent
LigandPNGBDBM210815(US10463663, Example 53 | US11129828, Example 53 | ...)
Affinity DataIC50:  19nM. Assay description: Human DAAO enzyme was supplied by the Takeda Pharmaceutical Company (Osaka) and each batch was tested and used at concentrations giving comparable le...
Ligand InfoPC cidPC sid
In DepthDetails US Patent