BDBM210878 US9290467, 48
SMILES Fc1cc(Cl)c2OC\C=C\COc3ccc(C[C@H](NC(=O)c2c1)C(=O)NC1(CC1)C#N)cc3Cl
InChI Key InChIKey=AVONJZBQFJHNRF-SNDJDQCESA-N
Data  1 IC50
  Tab Delimited (TSV)   2D SDfile   Computed 3D by Vconf -m prep SDfile
Find this compound or compounds like it in BindingDB:
Activity Spreadsheet -- Enzyme Inhibition Constant Data from BindingDB
Found 1 hit for monomerid = 210878
TargetProcathepsin L(Homo sapiens (Human))
Hoffmann-La Roche
US Patent
LigandPNGBDBM210878(US9290467, 48)
Affinity DataIC50:  139nMpH: 6.5Assay Description:Enzyme activity is measured by observing the increase in fluorescence intensity caused by cleavage of a peptide substrate containing a fluorophore wh...
Ligand InfoPC cidPC sid
In DepthDetails US Patent