BDBM210934 UCP1206
SMILES CCc1nc(N)nc(N)c1C#C[C@H](C)c1cc2OCOc2c(c1)-c1ccc(cc1)C(O)=O
InChI Key InChIKey=NQHZOWBSMCFILX-ZDUSSCGKSA-N
Data  4 IC50
  Tab Delimited (TSV)   2D SDfile   Computed 3D by Vconf -m prep SDfile
Find this compound or compounds like it in BindingDB:
Activity Spreadsheet -- Enzyme Inhibition Constant Data from BindingDB
Found 4 hits for monomerid = 210934
TargetDihydrofolate reductase(Staphylococcus aureus)
University Of Connecticut
LigandPNGBDBM210934(UCP1206)
Affinity DataIC50:  17nM. Assay description: IC50 values were determined following a standard method that has been described previously (Reeve et al., 2014, 2016).
Ligand InfoPC cidPC sid
In DepthDetails ArticlePubMed
TargetDihydrofolate reductase(Staphylococcus aureus)
University Of Connecticut
LigandPNGBDBM210934(UCP1206)
Affinity DataIC50:  54nM. Assay description: IC50 values were determined following a standard method that has been described previously (Reeve et al., 2014, 2016).
Ligand InfoPC cidPC sid
In DepthDetails ArticlePubMed
TargetDihydrofolate reductase type 1 from Tn4003(Staphylococcus aureus)
University Of Connecticut
LigandPNGBDBM210934(UCP1206)
Affinity DataIC50:  180nM. Assay description: IC50 values were determined following a standard method that has been described previously (Reeve et al., 2014, 2016).
Ligand InfoPC cidPC sid
In DepthDetails ArticlePubMed
TargetDihydrofolate reductase(Staphylococcus aureus)
University Of Connecticut
LigandPNGBDBM210934(UCP1206)
Affinity DataIC50:  190nM. Assay description: IC50 values were determined following a standard method that has been described previously (Reeve et al., 2014, 2016).
Ligand InfoPC cidPC sid
In DepthDetails ArticlePubMed